Gouda Tijdmachine Ontologie
type: Ontology
abstract: De Gouda Tijdmachine beschrijft en linkt geo-temporele objecten die betrekking hebben op plaats (en personen in) Gouda. Deze ontologie beschrijft met name de generieke klasse GeoTemporeelObject, de properties en subklassen. De ontologie is opgezet in het Nederlands.
abstract: The Gouda Time Machine describes and links geo-temporal objects related to the city (and people) of Gouda. This ontology specifically describes the generic GeoTemporalObject class, its properties and subclasses. The ontology is set up in Dutch. @en
bibliographic citation: Gouda Tijdmachine Ontologie, versie 0.9, https://www.goudatijdmachine.nl/def/
bibliographic citation: Gouda Time Machine Ontology, versie 0.9, https://www.goudatijdmachine.nl/def/ @en
created: 2021-11-25
creator: Bob Coret
  member of: Gouda Tijdmachine
    name: Gouda Time Machine @en
has version: 0.10
license: https://creativecommons.org/licenses/by/4.0/
modified: 2025-10-04
title: Gouda Time Machine Ontology @en
preferred namespace prefix: gtm
preferred namespace uri: https://www.goudatijdmachine.nl/def#
comment: De Gouda Tijdmachine Ontologie beschrijft de geo-temporele klasses en eigenschappen die gebruikt worden binnen de Gouda Tijdmachine. In onderstaand diagram geven de blauwe blokken klasses aan, de pijlen hiertussen subklassen, en de rode blokken zijn aan de klasse verbonden properties.
comment: The Gouda Time Machine Ontology describes the geo-temporal classes and properties used within the Gouda Time Machine. In the diagram below, the blue blocks indicate classes, the arrows between them subclasses, and the red blocks are properties associated with the class. @en
creative work status: Gouda Tijdmachine Ontologie Specificatie
creative work status: Gouda Time Machine Ontology Specification @en
introduction: De voorkeur prefix voor deze ontologie is gtm.

heeft geometrie
type: ObjectProperty
domain: Geo-temporeel object
range: Geometry
label: has geometry @en

adresseert
type: ObjectProperty
domain: Adressering
range: Gebouw
comment: De eigenschap 'adresseert' geeft aan dat een entiteit is geassocieerd met een specifiek adres, wat een unieke locatie aangeeft binnen een geografisch gebied.
comment: The property 'adresseert' (adresses) indicates that an entity is associated with a specific address, which denotes a unique location within a geographic area. @en
label: addresses @en

heeft adres
type: ObjectProperty
inverse of: adresseert
domain: Gebouw
range: Adressering
comment: De eigenschap 'heeft adres' geeft aan dat een entiteit is geassocieerd met een specifiek adres, wat een unieke locatie aangeeft binnen een geografisch gebied.
comment: The property 'heeft adres' (has address) indicates that an entity is associated with a specific address, which denotes a unique location within a geographic area. @en
label: has address @en

ligt in
type: ObjectProperty
domain: Structuur
range: Structuur
label: located in @en

ligt in straat
type: ObjectProperty
domain: Straatnummer aanduiding
range: Straat
label: is located in street @en

ligt in wijk
type: ObjectProperty
domain: Buurt
range: Wijk
comment: De eigenschap 'ligt in wijk' geeft aan dat een buurt zich binnen een specifieke wijk bevindt, waarbij een wijk een afgebakend gebied is binnen een stad of dorp.
comment: The property 'located in district' indicates that an neighbourhood is situated within a specific district, where a district is a defined area within a city or town. @en
label: is located in district @en

staat op perceel
type: ObjectProperty
domain: Adressering
range: Perceel
comment: De eigenschap 'staat op perceel' geeft aan dat een entiteit zich bevindt op een specifiek perceel grond, waarbij een perceel een stuk land is dat afgebakend is voor een specifieke functie.
comment: The property 'is located on parcel' indicates that an entity is situated on a specific parcel of land, where a parcel is a piece of land delineated for a specific purpose. @en
label: build on plot @en

geometrie als well-known text (WKT)
type: DatatypeProperty
domain: Geometry
range: wktLiteral
label: geometry as well-known text (WKT) @en

einddatum
type: DatatypeProperty
domain: Geo-temporeel object
range: dateTime
label: end date @en

identificatie
type: DatatypeProperty
domain: Geo-temporeel object
range: string
label: identifier @en

naam
type: DatatypeProperty
domain: Geo-temporeel object
range: string
label: name @en

begindatum
type: DatatypeProperty
domain: Geo-temporeel object
range: dateTime
label: start date @en

Adressering
type: Class
subclass of: Geo-temporeel object
comment: Addressering is de toekenning van een adres aan een locatie, object of entiteit binnen een geografisch gebied, waardoor deze uniek geïdentificeerd kan worden voor post- en identificatiedoeleinden.
comment: Addressing is the assignment of an address to a location, object, or entity within a geographic area, enabling it to be uniquely identified for postal and identification purposes. @en
label: Addressing @en

Buurt
type: Class
subclass of: Structuur
comment: Onderdeel van een gemeente, dat op basis van historische dan wel stedenbouwkundige kenmerken homogeen is afgebakend. Homogeen wil zeggen dat één functie dominant is, bijvoorbeeld woonfunctie (woongebied), werkfunctie (industriegebied) of recreatieve functie (natuurgebied). Functies kunnen echter ook gemengd voorkomen. De gemeenten in Nederland zijn onderverdeeld in wijken en buurten. Buurten vormen het laagste regionale niveau. Wijken zijn optellingen van één of meer aaneengesloten buurten. De gemeente bepaalt zelf de indeling in wijken en buurten.
comment: Part of a municipality that is homogeneously demarcated on the basis of historical or urban development characteristics. Homogeneous means that one function is dominant, for example residential function (residential area), work function (industrial area) or recreational function (nature area). However, functions can also be mixed. The municipalities in the Netherlands are divided into districts and neighborhoods. Neighborhoods are the lowest regional level. Neighborhoods are sums of one or more contiguous neighborhoods. The municipality itself determines the division into districts and neighborhoods. @en
label: Neighbourhood @en

Constructie
type: Class
subclass of: Geo-temporeel object
comment: A construction is a human-made or naturally created object or ensemble, which have a physical form and function within a specific area. @en
comment: Een constructie is een door mensen gemaakt of natuurlijk gecreëerd object of geheel, die een fysieke vorm en functie hebben binnen een bepaald gebied.
label: Construction @en

Gebouw
type: Class
subclass of: Constructie
disjoint with: Kunstwerk
disjoint with: Natuur
comment: A building is the smallest functionally and architecturally-constructively independent unit that is directly and permanently connected to the earth and can be entered and locked. @en
comment: Een pand is een kleinste bij de totstandkoming functioneel en bouwkundig-constructief zelfstandige eenheid die direct en duurzaam met de aarde is verbonden en betreedbaar en afsluitbaar is.
label: Building @en

Geo-temporeel object
type: Class
subclass of: Feature
comment: A geo-temporal object is an entity that has both geographical and temporal characteristics, enabling the specification and analysis of the location and time period of events or objects in space. @en
comment: Een geo-temporeel object is een entiteit die zowel geografische als temporele kenmerken heeft, waardoor het mogelijk is om de locatie en tijdsperiode van gebeurtenissen of objecten in de ruimte te specificeren en te analyseren.
label: Geo temporal object @en

Hofje
type: Class
subclass of: Structuur
comment: A partly private community intended for the needy, usually consisting of a number of houses around a small park. @en
comment: Een deels besloten leefgemeenschap bedoeld voor behoeftigen, meestal bestaande uit een aantal huisjes rond een parkje.
label: Courtyard @en

Huisnaam
type: Class
subclass of: Adressering
disjoint with: Nummer aanduiding
disjoint with: Plaatselijke aanduiding
disjoint with: Straatnummer aanduiding
comment: Naam van een huis ter identificatie.
comment: Name of a house for identification. @en
label: House name @en

Kunstwerk
type: Class
subclass of: Constructie
disjoint with: Natuur
comment: A work of art is a civil engineering work for the infrastructure of roads, water, railways, flood defenses and/or pipes and is not intended for permanent human residence. @en
comment: Een kunstwerk is een civiel-technisch werk voor de infrastructuur van wegen, water, spoorbanen, waterkeringen en/of leidingen en niet bedoeld voor permanent menselijk verblijf.
label: Work of art @en

Kwartier
type: Class
subclass of: Structuur
comment: A quarter is a part of a city or town that is often characterized by a specific function or population group, such as a residential, commercial, or entertainment area. @en
comment: Een kwartier is een deel van een stad of dorp dat vaak wordt gekenmerkt door een specifieke functie of bevolkingsgroep, zoals een woon-, winkel- of uitgaansgebied.
label: Quarter @en

Natuur
type: Class
subclass of: Constructie
comment: Nature is everything in the physical world that is not made by humans, including plants, trees, landscapes, waterways, and other elements of the Earth. @en
comment: Natuur is alles in de fysieke wereld dat niet door mensen is gemaakt, inclusief planten, bomen, landschappen, waterwegen en andere elementen van de aarde.
label: Nature @en

Nummer aanduiding
type: Class
subclass of: Adressering
disjoint with: Plaatselijke aanduiding
disjoint with: Straatnummer aanduiding
comment: Een per wijk uitgegeven nummer.
comment: One number issued per district. @en
label: Number designation @en

Perceel
type: Class
subclass of: Structuur
comment: A plot is a limited part of Dutch territory that is cadastrally identified and bounded by cadastral boundaries. @en
comment: Een perceel is een begrensd deel van het Nederlands grondgebied dat kadastraal geïdentificeerd is en met kadastrale grenzen begrensd is.
label: Plot @en

Plaats
type: Class
subclass of: Structuur
comment: A place is an inhabited location such as a city, town, or other settlement, where people live and work. @en
comment: Een plaats is een bewoonde locatie zoals een stad, dorp of ander nederzetting, waar mensen wonen en werken.
label: Place @en

Plaatselijke aanduiding
type: Class
subclass of: Adressering
disjoint with: Straatnummer aanduiding
comment: Combinatie van de wijkletter en een per wijk uitgegeven nummer.
comment: Combination of the district letter and a number issued per district. @en
label: Place designation @en

Sectie
type: Class
subclass of: Structuur
comment: De sectie die de sectie binnen de kadastrale gemeente uniek identificeert.
comment: The section that uniquely identifies the section within the cadastral municipality. @en
label: Section @en

Straat
type: Class
subclass of: Structuur
comment: A street is a public road in a village, town, or other inhabited area. Streets are usually used by vehicles and pedestrians and can have houses, businesses, and other buildings on either side. @en
comment: Een straat is een openbare weg in een dorp, stad of ander bewoond gebied. Straten worden meestal gebruikt door voertuigen en voetgangers en kunnen huizen, bedrijven en andere gebouwen aan weerszijden hebben.
label: Street @en

Straatnummer aanduiding
type: Class
subclass of: Adressering
comment: A number issued per street. @en
comment: Een per straat uitgegeven nummer.
label: Street number designation @en

Structuur
type: Class
subclass of: Geo-temporeel object
comment: A structure is an organized collection of interconnected elements within a geographic area, such as a parcel, district, street, neighborhood, section, or place, that together form the physical and functional composition of a region. @en
comment: Een structuur is een georganiseerde verzameling van onderling verbonden elementen binnen een geografisch gebied, zoals een perceel, wijk, straat, buurt, sectie of plaats, die gezamenlijk de fysieke en functionele samenstelling van een regio vormen.
label: Structure @en

Wijk
type: Class
subclass of: Structuur
comment: Onderdeel van een gemeente en cluster van één of meerdere buurten, dat op basis van historische dan wel stedenbouwkundige kenmerken homogeen is afgebakend. Een wijk bestaat uit één of meerdere buurten.
comment: Part of a municipality and cluster of one or more neighborhoods, which is homogeneously demarcated on the basis of historical or urban development characteristics. A district consists of one or more neighborhoods. @en
label: District @en